Trade Association
type: Class
alternative label: Business Association
alternative label: Industry Association
alternative label: Industry Group
alternative label: Trade Organization
subclass of: R7oBWHStfmqTLn2MypkW3Pj
definition: A trade association is an organization founded and funded by businesses that operate in a specific industry. These associations advocate for the interests of their members, provide industry standards, and offer networking opportunities.
example: American Medical Association
example: Automotive Trade Association
example: Healthcare Trade Association
example: International Air Transport Association (IATA)
example: National Association of Manufacturers (NAM)
example: Retail Trade Association
example: Technology Trade Association