Common-Law Sodomy
type: Class
alternative label: 普通法通奸罪
subclass of: R9uiDByr48mJfLgUdiIZrSi
definition: The act of engaging in non-procreative sexual intercourse between persons of the same sex, which is prohibited by common law.