tax_invoice_cl_name
type: Class
subclass of: RHfeijrOTjaF7qpuoGIGkR
definition: "The name of the party paying VAT on the invoice. The legal name of the party paying VAT on the invoice may be different from the value required by the receiving system in the CLIENT.cl_name field. In some jurisdictions it may be required by law to provide this information. "