Motion to Proceed in Forma Pauperis
type: Class
alternative label: 以贫穷申请程序继续动议
subclass of: R8zwKGkogGKIKWSVWb1ItRL
subclass of: RbAyL0ru5m8CyqAShGVq0e
definition: A Motion to Proceed in Forma Pauperis is a legal request made by an individual who is unable to afford the fees associated with a court case, asking the court to waive or defer those fees.