Maritime Lien
type: Class
alternative label: 海事留置权
subclass of: R7OGr396bNkl4sseQ1bBCA6
definition: A maritime lien is a type of lien that gives a creditor the right to seize a vessel as collateral for unpaid debts related to the vessel's operation or maintenance.