Alternative Legal Services
type: Class
subclass of: R9B8sRCK209t5Y8LlU4f62a
definition: Alternative Legal Services refers to non-traditional legal services that are provided by entities other than law firms, such as managed services, eDiscovery services, and contracting management services.