Sino-Tibetan languages
type: Class
alternative label: 汉藏语系
subclass of: RDOvAHsvY8TKJ1O1orXPM9o
definition: A group of languages spoken in East Asia, including Mandarin, Cantonese, and Tibetan, among others.