DUPE Report
type: Class
alternative label: Document
subclass of: R8H8cpx25KBk3kH55YwSdDv
definition: A DUPE Report (Document) is a type of document that is no longer in use and is associated with DEPRECATED NODES.