Criminal Contempt
type: Class
alternative label: 刑事藐视
subclass of: RCDWrRUM7m6ja3CN3N5pgyk
definition: Criminal Contempt refers to the intentional disobedience or disregard of a court order or judgment, which is punishable by fines or imprisonment.