Bylaws
type: Class
preferred label: Corporate Bylaws
alternative label: Corporate Byelaws
subclass of: RCBtDyjzrPbQyhvU5V64Irn
definition: Bylaws are internal regulations adopted by an organization to manage its operations and procedures. They detail roles of officers, meeting protocols, and other organizational rules.