Indiana Town Court - Lake County, Merrillville Town
type: Class
subclass of: RBB5cexM3974afJhhR2yXHA
definition: A court located in Merrillville Town, Lake County, Indiana that has limited jurisdiction over minor criminal offenses, traffic violations, and small claims cases within its geographical area.