New Mexico Metropolitan Court
type: Class
subclass of: R0D401c6E3b7d715c1eAF69c
definition: The New Mexico Metropolitan Court is a court of limited jurisdiction within the New Mexico State Courts system, located in Bernalillo County.