Mentoring
type: Class
alternative label: 导师制度
subclass of: R7p8xRy14cVNnXyHxD92nQk
definition: Mentoring refers to the process of providing guidance and support to an individual who has been subject to criminal disposition conditions, with the aim of helping them successfully reintegrate into society.