No-Shop Covenant
type: Class
alternative label: 不购物条款
subclass of: RHZTIZfN6Fbrf6azRExLaD
definition: A No-Shop Covenant is a provision in a business deal that restricts one party from seeking other offers or engaging in negotiations with other potential buyers, in order to protect the interests of the other party involved in the deal.