Islamic Law
type: Class
preferred label: Sharia Law
alternative label: Fiqh Law
alternative label: Islamic Jurisprudence
subclass of: RBkzNeCV70lWNDKaIVq358i
definition: Sharia Law is an Islamic legal system based on the Quran and the teachings and practices of the Prophet Muhammad, governing aspects of both personal and communal life.