Tereno
type: Class
subclass of: RDOvAHsvY8TKJ1O1orXPM9o
definition: A Tereno language is a structured system of communication that consists of grammar and vocabulary, and is spoken by the Terena people in Brazil.