Secondment
type: Class
alternative label: 借调
subclass of: R7jfj4n9nrwFA6hog2jNl5I
definition: Secondment refers to an arrangement where an employee is temporarily assigned to work for another organization or department, while still remaining an employee of their original employer, as part of an engagement for providing legal services.