Zhuang; Chuang
type: Class
alternative label: 壮族; 壮
subclass of: RDOvAHsvY8TKJ1O1orXPM9o
definition: A language spoken by the Zhuang people, primarily in the Guangxi Zhuang Autonomous Region of southern China.