Litigation Management
type: Class
subclass of: R9B8sRCK209t5Y8LlU4f62a
definition: Litigation Management involves the management of various aspects of a legal case, including but not limited to, retention and litigation hold management, redaction management, expert witness management, brief analysis management, jury selection management, citation check management, remote trial management, eDiscovery services, exhibit management, and costs and settlement management.