Immigration Regulatory Objectives
type: Class
subclass of: RCDwLiS22z6MzQaQHS08hvk
definition: Immigration Regulatory Objectives: The specific aims, goals, plans, and intentions related to the regulation of immigration, including the legal frameworks and policies.