Outside Counsel Guidelines
type: Class
preferred label: OCG
alternative label: 外部律师指南
subclass of: R9YxIkGNEnotiOtItG96PxY
definition: Outside Counsel Guidelines are a set of expectations set by a company or organization for the external law firms or attorneys it hires, detailing billing, communication, conflicts of interest, confidentiality, and other work-related parameters.