560 Civil Detainee - Conditions of Confinement (PACER NoS)
type: Class
subclass of: RnhXmv223OLuy6W4pzIHlD
definition: Action by former prisoner who was involuntarily committed to a non criminal facility after expiration of his or her prison term alleging unlawful conditions of confinement while in the non-criminal facility. This category includes, for example, an action by a former prisoner classified as a Sexually Dangerous Person or Sexually Violent Predator alleging civil rights violations during his detention in a medical facility. (Excludes actions by alien detainees)