Real Estate Documents
type: Class
alternative label: 房地产文件
subclass of: RQR64SI6XmYz5JlNaDUOZN
definition: Real Estate Documents are written or recorded representations of property ownership, transfer, or use, including but not limited to deeds, mortgages, and leases.