Unit per Hour
type: Class
alternative label: 每小时单位
subclass of: Ro1RKRYnlciGrhgC4NjuDV
definition: A "Unit per Hour" is a type of unit used to measure the cost of legal services, where the fee is based on the amount of time spent providing the service.