JC30 Pre-action protocol work (UK J-CODE)
type: Class
subclass of: RDUeVcYpQzvSPm94gCpCNxO
definition: Communications at an initial stage in compliance with pre-action protocol including letters before action and responses.