Minnesota District Court - Yellow Medicine County
type: Class
subclass of: RxLV9XEaDWbDIA8N1fl2fM
definition: A Minnesota District Court located in Yellow Medicine County, which is responsible for hearing and deciding civil and criminal cases within its jurisdiction.