Negligent Misrepresentation
type: Class
alternative label: 过失虚假陈述
subclass of: R7JKVOM2aFkvG1yiLzF7ndA
subclass of: RCfunX4u69LUQ3gbhckE0oI
subclass of: RRC3CmU6w2he0zPcqr6J7p
definition: Negligent Misrepresentation is a legal claim that arises when a party makes a false statement or omits important information, which they should have known was false or misleading, and that causes harm to another party.