Probate Reason of Death/Incapacity/No longer Willing
type: Class
alternative label: 遗产死亡/无能力/不再愿意的原因
subclass of: RI5hwGjH6o0HX7MTQbZm3Q
definition: A legal reason for filing a subsequent probate, which includes the death, incapacity, or unwillingness of the original probate filer.