Motion to File Nonstandard Brief
type: Class
alternative label: 提交非标准简报的动议
subclass of: R8ludoWmVMfon7jd8o6ak6E
subclass of: R8xekNn7K6SxToo5ArjIsTX
definition: A Motion to File Nonstandard Brief is a formal request to submit a legal document that does not conform to the standard formatting requirements set forth by the court.