Quiet Enjoyment Clause
type: Class
alternative label: 安宁享有条款
subclass of: RDe0RKU39BlhcyACJW30ZLc
definition: A Quiet Enjoyment Clause is a provision in a contract that guarantees a tenant's right to use and enjoy the leased property without interference from the landlord or any third party.