New York City Court - Hornell
type: Class
subclass of: RCz0OhGJQscjwPvw2jQBP63
definition: A court located in Hornell, New York City that has jurisdiction over certain legal matters within its geographical area.