Analysis of Insurance Considerations
type: Class
alternative label: 保险考虑分析
subclass of: RDrxLQS4WPXUa6tUdBGdu2r
definition: Analysis of Insurance Considerations refers to the process of evaluating the potential impact of insurance policies on a legal obligation, such as a contract or tort liability.