inv_payment_terms
type: Class
subclass of: RHfeijrOTjaF7qpuoGIGkR
definition: "Discount applied to the invoice if it is paid within the stated number of days. ""10.00/30"" would indicate that the firm will accept a 10% discount of inv_total_net_due if paid within 30 days of the invoice_date. CAN NOT be used if any tax is charged against any matter/invoice that is part of this inv_id because there may be a legal requirement that the tax amount charged should not be modified. Law firm can not apply this reduction to the invoice because it is dependent on the payment turnaround by the client; represents an additional discount that must be applied by the client's accounts payable system or third party e-billing vendor if the payment terms are met. "