Citation to Secondary Legal Authority
type: Class
alternative label: 引用次要法律权威
subclass of: R7fEpxSrDSl1VojeYSxppg
definition: A document's citations to non-primary - secondary - legal authority (e.g., treatises, law journals, jury instructions).