Litigation Case - Short Name
type: Class
alternative label: 诉讼案件 - 简称
subclass of: RzPjBFXOANWEOTITOwQc0u
definition: A shortened name for a specific legal case that is currently in the process of being litigated.