Mississippi Circuit Court
type: Class
subclass of: R8A4a837BE2d5AB3c793565b
definition: The Mississippi Circuit Court is a court within the Mississippi State Courts system that has jurisdiction over civil and criminal cases at the trial level.