Recoupment for Contract Breach Harming Outsider
type: Class
alternative label: 追偿合同违约损害第三方
subclass of: R9b5fs8QJuliSZYeaJLJU2t
subclass of: RZ1dOPJ6HH6lMJGSLNxfwV
subclass of: RbkhZxcSyqaKNyUivxRRpu
definition: Recoupment for Contract Breach Harming Outsider: A legal claim for restitution or compensation sought by a third party who has suffered harm as a result of a breach of contract between two other parties.