Rail Transportation Industry
type: Class
alternative label: 铁路运输行业
subclass of: RUE4fCCSnGX1wIK324EyiL
hidden label: RAIL
definition: Industries in this group provide rail transportation of passengers and/or cargo using railroad rolling stock. The railroads in this subsector primarily either operate on networks, with physical facilities, labor force, and equipment spread over an extensive geographic area, or operate over a short distance on a local rail line.