New York Court of Special Sessions
type: Class
subclass of: R3391bdB1A2adE51071C7cf7
definition: The New York Court of Special Sessions is a court within the New York State Courts system that handles minor criminal cases and traffic violations.