Indiana Town Court - St. Joseph County, Walkerton Town
type: Class
subclass of: RBB5cexM3974afJhhR2yXHA
definition: A court located in Walkerton Town, St. Joseph County, Indiana that has limited jurisdiction over minor criminal offenses, traffic violations, and small claims cases within its geographical area.