Modification Clause
type: Class
alternative label: 修改条款
subclass of: RDe0RKU39BlhcyACJW30ZLc
definition: A Modification Clause is a provision in a contract that allows the parties to change or amend the terms of the agreement.