Texas Court of Appeals - 5th
type: Class
subclass of: RD5301cBC22f7951939C20e0
definition: The Texas Court of Appeals - 5th is a specific intermediate appellate court in Texas that hears appeals from lower courts within its jurisdiction.