Construction Negligence Claims
type: Class
alternative label: 建筑疏忽索赔
subclass of: R36wLJ9yrSSbgRsE4xKJGM
subclass of: RCfunX4u69LUQ3gbhckE0oI
definition: Construction Negligence Claims: Legal claims brought against construction companies or contractors for their failure to exercise reasonable care in the construction process, resulting in harm or damage to individuals or property.