Motion to Stay Proceedings Pending Inter Partes Review
type: Class
alternative label: 暂停程序，等待当事人审查
subclass of: R8r0fE60KG2VwRq1OwbjEUY
definition: A Motion to Stay Proceedings Pending Inter Partes Review is a request to temporarily halt legal proceedings while a third party reviews the validity of a patent.