Use of Logo Clause
type: Class
alternative label: 标志使用条款
subclass of: RDe0RKU39BlhcyACJW30ZLc
definition: The Use of Logo Clause is a provision in a contract that specifies the conditions under which a party may use the other party's logo or trademark.