Buyer Consent Requirement Applies Only to Specified Negative Covenants
type: Class
alternative label: 买方同意要求仅适用于指定的负面契约
subclass of: R9xgvrUWmxGlvR7ooOgWvo7
definition: A provision in a contract that requires the buyer's approval only for certain restrictions on the property, rather than all restrictions, as specified in the agreement.