Caribbean Community
type: Class
preferred label: CARICOM
subclass of: R9H0HvybK6M3RpFebn0SDLu
definition: CARICOM (Caribbean Community): An organization of Caribbean nations and dependencies aiming for economic integration and cooperation among its members, ensuring that the benefits of integration are equitably shared, and coordinating foreign policy.