Payee Name - Fees
type: Class
alternative label: 收款人姓名 - 费用
subclass of: RSv0HBRq8RHUfm3K53ZFAT
definition: The concept of "Payee Name - Fees" refers to the specific name of the individual or entity who is receiving payment for legal services rendered, and the amount of fees charged for those services.