Confidential Informant Privilege
type: Class
alternative label: 保密线人特权
subclass of: Rxkyjui3De88JNN2ZCqKrt
definition: The Confidential Informant Privilege is a legal protection that allows individuals who provide information to law enforcement agencies to remain anonymous and keep their identities confidential.