Khoisan languages
type: Class
alternative label: 科伊桑语系
subclass of: RDOvAHsvY8TKJ1O1orXPM9o
definition: Khoisan languages are a group of languages spoken by the Khoisan people in southern Africa, characterized by the use of click consonants.